BDBM50004057 3-[4-(6-Amino-hexyloxy)-phenyl]-propionic acid::CHEMBL420043
SMILES NCCCCCCOc1ccc(CCC(O)=O)cc1
InChI Key InChIKey=ACOZRYVAIZLYNI-UHFFFAOYSA-N
Data  1 IC50
  Tab Delimited (TSV)   2D SDfile   Computed 3D by Vconf -m prep SDfile
Find this compound or compounds like it in BindingDB:
Activity Spreadsheet -- Enzyme Inhibition Constant Data from BindingDB
Found 1 hit for monomerid = 50004057
TargetIntegrin alpha-IIb/beta-3(Homo sapiens (Human))
Merck Research Laboratories
Curated by ChEMBL
LigandPNGBDBM50004057(3-[4-(6-Amino-hexyloxy)-phenyl]-propionic acid | C...)
Affinity DataIC50: >1.00E+5nM. Assay description: Inhibition of [125I]-Fibrinogen binding to fibrinogen receptor
In DepthDetails ArticlePubMed